Target
Carbonic anhydrase 6
Ligand
BDBM237301
Substrate
Meas. Tech.
Esterase Activity Assay
IC50
8430±n/a nM
Citation
 Alp, CÖzsoy, Å¿Alp, NAErdem, DGültekin, MSKüfrevioglu, ÿİSentürk, MSupuran, CT Sulfapyridine-like benzenesulfonamide derivatives as inhibitors of carbonic anhydrase isoenzymes I, II and VI. J Enzyme Inhib Med Chem 27:818-24 (2012)  
Target
Name:
Carbonic anhydrase 6
Synonyms:
CA-VI CAH6_HUMAN Carbonic Anhydrase VI Carbonic anhydrase 6 Carbonic anhydrase 6 (CA-VI) Salivary carbonic anhydrase | Secreted carbonic anhydrase
Type:
Enzyme
Mol. Mass.:
35371.40
Organism:
Homo sapiens (Human)
Description:
P23280
Residue:
308
  
Inhibitor
Name:
BDBM237301
Synonyms:
N-(2-cyanophenyl)-4-methylbenzenesulfonamide (6)
Type:
Small organic molecule
Emp. Form.:
C14H12N2O2S
Mol. Mass.:
272.322
SMILES:
Cc1ccc(cc1)S(=O)(=O)Nc1ccccc1C#N
: