Target
Carbonic anhydrase 1
Ligand
BDBM19461
Substrate
Meas. Tech.
Esterase Activity Assay
pH
7.4±n/a
Ki
9.7e+2±n/a nM
Comments
extracted
Citation
 Koz, ÿEkinci, DPerrone, APiacente, SAlankus-Çaliskan, ÿBedir, ESupuran, CT Analysis of saponins and phenolic compounds as inhibitors of a-carbonic anhydrase isoenzymes. J Enzyme Inhib Med Chem 28:412-7 (2013)  
Target
Name:
Carbonic anhydrase 1
Synonyms:
CA-I CAB Carbonate dehydratase I Carbonic anhydrase 1 (CA I) Carbonic anhydrase 1 (Recombinant CA I) Carbonic anhydrase B Carbonic anhydrase I (CA I) Carbonic anhydrase I (CAI) Carbonic anhydrase isoenzyme I (hCA I) | hCA
Type:
Enzyme
Mol. Mass.:
28873.37
Organism:
Homo sapiens (Human)
Description:
P00915
Residue:
261
  
Inhibitor
Name:
BDBM19461
Synonyms:
α-CA inhibitor, 5 CHEMBL32571 Naringenin (NAR) salipurpol
Type:
Estrgen Antagonist
Emp. Form.:
C15H12O5
Mol. Mass.:
272.2528
SMILES:
Oc1ccc(cc1)C1CC(=O)c2c(O)cc(O)cc2O1
: