Target
Carbonic anhydrase 4
Ligand
BDBM19461
Substrate
Meas. Tech.
Esterase Activity Assay
pH
7.4±n/a
Ki
1.12e+3±n/a nM
Comments
extracted
Citation
 Koz, ÿEkinci, DPerrone, APiacente, SAlankus-Çaliskan, ÿBedir, ESupuran, CT Analysis of saponins and phenolic compounds as inhibitors of a-carbonic anhydrase isoenzymes. J Enzyme Inhib Med Chem 28:412-7 (2013)  
Target
Name:
Carbonic anhydrase 4
Synonyms:
CA-IV CAH4_HUMAN Carbonic anhydrase Carbonic anhydrase IV (CA IV)
Type:
Enzyme
Mol. Mass.:
35037.98
Organism:
Homo sapiens (Human)
Description:
P22748
Residue:
312
  
Inhibitor
Name:
BDBM19461
Synonyms:
α-CA inhibitor, 5 CHEMBL32571 Naringenin (NAR) salipurpol
Type:
Estrgen Antagonist
Emp. Form.:
C15H12O5
Mol. Mass.:
272.2528
SMILES:
Oc1ccc(cc1)C1CC(=O)c2c(O)cc(O)cc2O1
: