Target
Aminopeptidase N
Ligand
BDBM23971
Substrate
Meas. Tech.
APN Inhibition Assay
pH
7.5±n/a
Temperature
298.15±n/a K
IC50
2550±110 nM
Comments
extracted
Citation
 Zhang, XZhang, LZhang, JFeng, JYuan, YFang, HXu, W Design, synthesis and preliminary activity evaluation of novel 3-amino-2-hydroxyl-3-phenylpropanoic acid derivatives as aminopeptidase N/CD13 inhibitors. J Enzyme Inhib Med Chem 28:545-51 (2013)  
Target
Name:
Aminopeptidase N
Synonyms:
AMPN_PIG AP-M Alanyl aminopeptidase Aminopeptidase N (APN) Microsomal aminopeptidase pAPN
Type:
Protein
Mol. Mass.:
108810.25
Organism:
Sus scrofa (Pig)
Description:
P15145
Residue:
963
  
Inhibitor
Name:
BDBM23971
Synonyms:
(2S)-2-[(2S,3R)-3-amino-2-hydroxy-4-phenylbutanamido]-4-methylpentanoic acid CHEMBL29292 | Ubenimex
Type:
Small organic molecule
Emp. Form.:
C16H24N2O4
Mol. Mass.:
308.3728
SMILES:
CC(C)C[C@H](NC(=O)[C@@H](O)[C@H](N)Cc1ccccc1)C(O)=O
: