Target
Glutathione peroxidase 1
Ligand
BDBM50049707
Substrate
Meas. Tech.
Glutathione Peroxidase Activity Assay
pH
7±n/a
Ki
34100±n/a nM
IC50
48600±n/a nM
Comments
extracted
Citation
 Ekinci, DCankaya, MGül, Ä°Coban, TA Susceptibility of cord blood antioxidant enzymes glutathione reductase, glutathione peroxidase and glutathione S-transferase to different antibiotics: in vitro approach. J Enzyme Inhib Med Chem 28:824-9 (2013)  
Target
Name:
Glutathione peroxidase 1
Synonyms:
Cellular glutathione peroxidase GPX1_HUMAN GSHPx-1 | Glutathione peroxidase 1 (GPx)
Type:
Enzyme
Mol. Mass.:
21937.89
Organism:
Homo sapiens (Human)
Description:
P07203
Residue:
202
  
Inhibitor
Name:
BDBM50049707
Synonyms:
(6R,7R)-7-{2-(2-Amino-thiazol-4-yl)-2-[(Z)-methoxyimino]-acetylamino}-3-(2-methyl-5,6-dioxo-1,2,5,6-tetrahydro-[1,2,4]triazin-3-ylsulfanylmethyl)-8-oxo-5-thia-1-aza-bicyclo[4.2.0]oct-2-ene-2-carboxylic acid (6R,7R,)-7-(2-(2-aminothiazol-4-yl)-2-(methoxyimino)acetamido)-3-((2-methyl-5,6-dioxo-1,2,5,6-tetrahydro-1,2,4-triazin-3-ylthio)methyl)-8-oxo-5-thia-1-aza-bicyclo[4.2.0]oct-2-ene-2-carboxylic acid 7-[2-(2-Amino-thiazol-4-yl)-2-methoxyimino-acetylamino]-3-(6-hydroxy-2-methyl-5-oxo-2,5-dihydro-[1,2,4]triazin-3-ylsulfanylmethyl)-8-oxo-5-thia-1-aza-bicyclo[4.2.0]oct-2-ene-2-carboxylic acid (Ceftriaxone) CHEMBL161 | ceftriaxone
Type:
Small organic molecule
Emp. Form.:
C18H18N8O7S3
Mol. Mass.:
554.58
SMILES:
CO\N=C(/C(=O)N[C@H]1[C@H]2SCC(CSc3nc(=O)c(=O)[nH]n3C)=C(N2C1=O)C(O)=O)c1csc(N)n1
: