Target
Beta-secretase 2
Ligand
BDBM242229
Substrate
Meas. Tech.
HTRF FRET Assay
pH
5±n/a
Temperature
303.15±n/a K
Ki
0.73±n/a nM
Comments
extracted
Citation
 Gilbert, EJCumming, JNStamford, AWYu, YScott, JDIserloh, UWang, LCaldwell, JP Tricyclic substituted thiadiazine dioxide compounds as BACE inhibitors, compositions and their use US Patent  US9416129 Publication Date 8/16/2016 
Target
Name:
Beta-secretase 2
Synonyms:
AEPLC ASP1 Asp 1 Aspartyl protease 1 BACE2_HUMAN Beta-secretase (BACE) Beta-secretase 2 (BACE-2) Beta-site APP-cleaving enzyme 2 Memapsin-1 beta-Secretase (BACE-2)
Type:
Protein
Mol. Mass.:
56171.20
Organism:
Homo sapiens (Human)
Description:
Q9Y5Z0
Residue:
518
  
Inhibitor
Name:
BDBM242229
Synonyms:
US9416129, 7
Type:
Small organic molecule
Emp. Form.:
C18H17FN4O3S2
Mol. Mass.:
420.481
SMILES:
CN1C(=N)N[C@@](C)(CS1(=O)=O)c1sc(cc1F)-c1cccc(c1)-c1ncco1
: