Target
Beta-secretase 2
Ligand
BDBM242938
Substrate
Meas. Tech.
Time-Resolved Endpoint Proteolysis Assay
pH
5±n/a
Temperature
303.15±n/a K
Ki
0.69±n/a nM
Comments
extracted
Citation
 Gilbert, EJCumming, JNStamford, AWYu, YScott, JDIserloh, U Tricyclic substituted thiadiazine dioxide compounds as BACE inhibitors, compositions and their use US Patent  US9422277 Publication Date 8/23/2016 
Target
Name:
Beta-secretase 2
Synonyms:
AEPLC ASP1 Asp 1 Aspartyl protease 1 BACE2_HUMAN Beta-secretase (BACE) Beta-secretase 2 (BACE-2) Beta-site APP-cleaving enzyme 2 Memapsin-1 beta-Secretase (BACE-2)
Type:
Protein
Mol. Mass.:
56171.20
Organism:
Homo sapiens (Human)
Description:
Q9Y5Z0
Residue:
518
  
Inhibitor
Name:
BDBM242938
Synonyms:
US9422277, 1
Type:
Small organic molecule
Emp. Form.:
C19H19ClN4O2S2
Mol. Mass.:
434.963
SMILES:
CN1C(=N)N[C@@](C)(CS1(=O)=O)c1sc(cc1Cl)-c1ccc([nH]1)-c1ccccc1
: