Target
Serine-protein kinase ATM
Ligand
BDBM245488
Substrate
Meas. Tech.
Cellular Assay
Temperature
310.15±n/a K
IC50
0.447±n/a nM
Comments
extracted
Citation
 Barlaam, BCPike, KG Imidazo[4,5-c]quinolin-2-one compounds and their use in treating Cancer US Patent  US9428503 Publication Date 8/30/2016 
Target
Name:
Serine-protein kinase ATM
Synonyms:
A-T mutated ATM_HUMAN | Ataxia telangiectasia mutated
Type:
Protein
Mol. Mass.:
350696.72
Organism:
Homo sapiens (Human)
Description:
Q13315
Residue:
3056
  
Inhibitor
Name:
BDBM245488
Synonyms:
US9428503, 15
Type:
Small organic molecule
Emp. Form.:
C27H31N5O3
Mol. Mass.:
473.5667
SMILES:
Cn1c2cnc3ccc(cc3c2n([C@@H]2C[C@H](O)C2)c1=O)-c1ccc(OCCCN2CCCC2)nc1
: