Target
Serine-protein kinase ATM
Ligand
BDBM245490
Substrate
Meas. Tech.
Cellular Assay
Temperature
310.15±n/a K
IC50
0.329±n/a nM
Comments
extracted
Citation
 Barlaam, BCPike, KG Imidazo[4,5-c]quinolin-2-one compounds and their use in treating Cancer US Patent  US9428503 Publication Date 8/30/2016 
Target
Name:
Serine-protein kinase ATM
Synonyms:
A-T mutated ATM_HUMAN | Ataxia telangiectasia mutated
Type:
Protein
Mol. Mass.:
350696.72
Organism:
Homo sapiens (Human)
Description:
Q13315
Residue:
3056
  
Inhibitor
Name:
BDBM245490
Synonyms:
US9428503, 17
Type:
Small organic molecule
Emp. Form.:
C26H31N5O3
Mol. Mass.:
461.556
SMILES:
CN(C)CCCOc1ccc(cn1)-c1ccc2ncc3n(C)c(=O)n([C@H]4CCCOC4)c3c2c1
: