Target
Replicase polyprotein 1a/Z-RLRGG-AMC
Ligand
BDBM246524
Substrate
Meas. Tech.
SARS-CoV PLpro Inhibition Assay
pH
8±0
Ki
4.2e+3±n/a nM
Citation
 Kim, DWSeo, KHCurtis-Long, MJOh, KYOh, JWCho, JKLee, KHPark, KH Phenolic phytochemical displaying SARS-CoV papain-like protease inhibition from the seeds of Psoralea corylifolia. J Enzyme Inhib Med Chem 29:59-63 (2014)  
Target
Name:
Replicase polyprotein 1a/Z-RLRGG-AMC
Synonyms:
PLpro/Z-RLRGG-AMC
Type:
Enzyme-Substrate
Mol. Mass.:
Description:
Components:
This complex has 2 components.
Component 1
Name:
Replicase polyprotein 1a
Synonyms:
3C-like proteinase 3CLp Growth factor-like peptide Non-structural protein 1 Non-structural protein 11 Non-structural protein 3 Non-structural protein 6 Non-structural protein 8 ORF1a polyprotein PL2-PRO Papain-like proteinase Replicase polyprotein 1a SARS coronavirus 3C-like proteinase nsp1 nsp11 nsp3 nsp5 nsp7 nsp9 pp1a
Type:
Enzyme
Mol. Mass.:
486353.36
Organism:
Human SARS coronavirus (SARS-CoV)
Description:
P0C6U8
Residue:
4382
  
Component 2
Name:
BDBM246526
Synonyms:
Z-Arg-Leu-Arg-Gly-Gly-7-amido-4-methylcoumarin | Z-RLRGG-AMC
Type:
Peptide
Emp. Form.:
C40H56N12O9
Mol. Mass.:
848.9476
SMILES:
CC(C)C[C@H](NC(=O)[C@H](CCCNC(N)=N)NC(=O)OCc1ccccc1)C(=O)N[C@@H](CCCNC(N)=N)C(=O)NCC(=O)NCC(=O)Nc1ccc2c(C)cc(=O)oc2c1
:
Inhibitor
Name:
BDBM246524
Synonyms:
Psoralidin (5)
Type:
Small organic molecule
Emp. Form.:
C20H16O5
Mol. Mass.:
336.338
SMILES:
[#6]\[#6](-[#6])=[#6]\[#6]-c1cc2c3oc4cc(-[#8])ccc4c3c(=O)oc2cc1-[#8]
: