Target
Carbonic anhydrase 9
Ligand
BDBM50334346
Substrate
Meas. Tech.
CO2 Hydration Assay
Ki
0.3±0.0 nM
Citation
 Pan, JLau, JMesak, FHundal, NPourghiasian, MLiu, ZBénard, FDedhar, SSupuran, CTLin, KS Synthesis and evaluation of 18F-labeled carbonic anhydrase IX inhibitors for imaging with positron emission tomography. J Enzyme Inhib Med Chem 29:249-55 (2014)  
Target
Name:
Carbonic anhydrase 9
Synonyms:
CA-IX CAH9_HUMAN Carbonic anhydrase 9 (CA IX) Carbonic anhydrase 9 precursor Carbonic anhydrase IX (CAIX) Carbonic anhydrases; II & IX MN RCC-associated antigen G250
Type:
Enzyme
Mol. Mass.:
49669.03
Organism:
Homo sapiens (Human)
Description:
Catalytic domain of human cloned isozyme was used in the assay
Residue:
459
  
Inhibitor
Name:
BDBM50334346
Synonyms:
4-(3-(2-cyanophenyl)ureido)benzenesulfonamide CA IX inhibitor, (C)3 | CHEMBL1643301
Type:
Small organic molecule
Emp. Form.:
C14H12N4O3S
Mol. Mass.:
316.335
SMILES:
NS(=O)(=O)c1ccc(NC(=O)Nc2ccccc2C#N)cc1
: