Target
Cytochrome P450 2C9
Ligand
BDBM247369
Substrate
Meas. Tech.
Inhibition Assays
IC50
30±n/a nM
Citation
 Blagg, JBavetsias, VMoore, ASLinardopoulos, S Pharmaceutically active compounds US Patent  US9447092 Publication Date 9/20/2016 
Target
Name:
Cytochrome P450 2C9
Synonyms:
(R)-limonene 6-monooxygenase CP2C9_HUMAN CYP2C9 Cytochrome P450 2C9 (CYP2C9 ) P-450MP P450 PB-1 | S-mephenytoin 4-hydroxylase
Type:
Enzyme
Mol. Mass.:
55636.33
Organism:
Homo sapiens (Human)
Description:
P11712
Residue:
490
  
Inhibitor
Name:
BDBM247369
Synonyms:
US9447092, 2
Type:
Small organic molecule
Emp. Form.:
C18H20ClN9O
Mol. Mass.:
413.864
SMILES:
Cc1nn(C)cc1-c1nc2c(N3CCN(Cc4ncon4)CC3)c(Cl)cnc2[nH]1
: