Target
Carbonic anhydrase [110-330]
Ligand
BDBM50159793
Substrate
Meas. Tech.
Stopped Flow CO2 Hydration Assay
pH
8.3±n/a
Temperature
293.15±n/a K
Ki
95100±n/a nM
Citation
 Dathan, NAAlterio, VTroiano, EVullo, DLudwig, MDe Simone, GSupuran, CTMonti, SM Biochemical characterization of the chloroplastic ß-carbonic anhydrase from Flaveria bidentis (L.) "Kuntze". J Enzyme Inhib Med Chem 29:500-4 (2014)  
Target
Name:
Carbonic anhydrase [110-330]
Synonyms:
CAHX_FLABI | Carbonic anhydrase (CA1)
Type:
Enzyme
Mol. Mass.:
24226.97
Organism:
Flaveria bidentis (Coastal plain yellowtops)
Description:
Truncated version without chloroplast transit peptide (1-109)
Residue:
221
  
Inhibitor
Name:
BDBM50159793
Synonyms:
CHEMBL1354 SODIUM ACETATE ANHYDROUS anhydrous sodium acetate | sodium acetate
Type:
Small organic molecule
Emp. Form.:
C2H3O2
Mol. Mass.:
59.0446
SMILES:
CC([O-])=O
: