Target
Beta-secretase 2
Ligand
BDBM249091
Substrate
Meas. Tech.
Time-Resolved Endpoint Proteolysis Assay
pH
5±n/a
Temperature
303.15±n/a K
Ki
0.4±n/a nM
Comments
extracted
Citation
 Gilbert, EJCumming, JNScott, JDWu, WBurnett, DAStamford, AW C2-azaspiro iminothiazine dioxides as BACE inhibitors, compositions, and their use US Patent  US9453034 Publication Date 9/27/2016 
Target
Name:
Beta-secretase 2
Synonyms:
AEPLC ASP1 Asp 1 Aspartyl protease 1 BACE2_HUMAN Beta-secretase (BACE) Beta-secretase 2 (BACE-2) Beta-site APP-cleaving enzyme 2 Memapsin-1 beta-Secretase (BACE-2)
Type:
Protein
Mol. Mass.:
56171.20
Organism:
Homo sapiens (Human)
Description:
Q9Y5Z0
Residue:
518
  
Inhibitor
Name:
BDBM249091
Synonyms:
US9453034, 5
Type:
Small organic molecule
Emp. Form.:
C20H21ClFN5O3S
Mol. Mass.:
465.929
SMILES:
CN1CC2(C1)C(=N)N[C@@](C)(CS2(=O)=O)c1cc(NC(=O)c2ccc(Cl)cn2)ccc1F
: