Target
Carbonic anhydrase
Ligand
BDBM50344898
Substrate
Meas. Tech.
ChEMBL_158307 (CHEMBL763192)
pH
7.5±n/a
Temperature
293.15±n/a K
Ki
610000±n/a nM
Citation
 Del Prete, SVullo, DDe Luca, VCarginale, Vdi Fonzo, POsman, SMAlOthman, ZSupuran, CTCapasso, C Anion inhibition profiles of a-, ß- and ¿-carbonic anhydrases from the pathogenic bacterium Vibrio cholerae. Bioorg Med Chem 24:3413-7 (2016)  
Target
Name:
Carbonic anhydrase
Synonyms:
VchCA
Type:
Protein
Mol. Mass.:
26434.13
Organism:
Vibrio cholerae serotype O1 (strain ATCC 39315 / El Tor Inaba N16961)
Description:
Q9KMP6
Residue:
239
  
Inhibitor
Name:
BDBM50344898
Synonyms:
CHEMBL1081267 | sodium perruthenate
Type:
Small organic molecule
Emp. Form.:
O4Ru
Mol. Mass.:
165.07
SMILES:
O=[Ru-](=O)(=O)=O
: