Target
Cyclin-dependent kinase 2/G1/S-specific cyclin-E1
Ligand
BDBM2590
Substrate
ING Peptide
Meas. Tech.
CDK Kinase Inhibition Assay
Temperature
298.15±n/a K
IC50
1950±n/a nM
Comments
extracted
Citation
 Sanchez-Martinez, CShih, CZhu, GLi, TBrooks, HBPatel, BKSchultz, RMDeHahn, TBSpencer, CDWatkins, SAOgg, CAConsidine, EDempsey, JAZhang, F Studies on cyclin-dependent kinase inhibitors: indolo-[2,3-a]pyrrolo[3,4-c]carbazoles versus bis-indolylmaleimides. Bioorg Med Chem Lett 13:3841-6 (2003)  
Target
Name:
Cyclin-dependent kinase 2/G1/S-specific cyclin-E1
Synonyms:
CDK2/CycE CDK2/E Cyclin-Dependent Kinase 2 (CDK2) Cyclin-dependent kinase 2/cyclin E1
Type:
Protein
Mol. Mass.:
Description:
Components:
This complex has 2 components.
Component 1
Name:
Cyclin-dependent kinase 2
Synonyms:
CDK2 CDK2_HUMAN Cell division protein kinase 2 Protein cereblon/Cyclin-dependent kinase 2 | p33 protein kinase
Type:
Enzyme Subunit
Mol. Mass.:
33938.17
Organism:
Homo sapiens (Human)
Description:
P24941
Residue:
298
  
Component 2
Name:
G1/S-specific cyclin-E1
Synonyms:
CCNE CCNE1_HUMAN
Type:
Enzyme Subunit
Mol. Mass.:
47073.17
Organism:
Homo sapiens (Human)
Description:
Residue:
410
  
Inhibitor
Name:
BDBM2590
Synonyms:
(Arylindolyl)maleimide deriv. 12 ROCHE screening, 40 | bis-indolylmaleimide deriv. 8g
Type:
Small organic molecule
Emp. Form.:
C21H15N3O2
Mol. Mass.:
341.3627
SMILES:
Cn1cc(C2=C(C(=O)NC2=O)c2c[nH]c3ccccc23)c2ccccc12
:
Substrate
Name:
ING Peptide
Synonyms:
Type:
Peptide
Mol. Mass.:
1341.50
Organism:
Description:
amino acid residues 246-257 from human retinoblastoma 1 protein.
Residue:
12
INGSPRTPRRGQ