Target
Integrase
Ligand
BDBM294738
Substrate
Meas. Tech.
Anti-HIV Activity MT4 Assay
IC50
2.00±n/a nM
Citation
 Johns, BAVelthuisen, EJWeatherhead, JGSuwandi, LTemelkoff, D Isoindoline derivatives for use in the treatment of a viral infection US Patent  US10112899 Publication Date 10/30/2018 
Target
Name:
Integrase
Synonyms:
Human immunodeficiency virus type 1 integrase
Type:
PROTEIN
Mol. Mass.:
32231.48
Organism:
Human immunodeficiency virus 1
Description:
ChEMBL_90865
Residue:
288
  
Inhibitor
Name:
BDBM294738
Synonyms:
(S)-2-(tert-butoxy)-2-((M)-6-(8-fluoro-5-methylchroman-6-yl)-4,7-dimethyl-2-((S)-2-methylpyrrolidine-1-carbon yl)isoindolin-5-yl)acetic acid | US10112899, Example 212
Type:
Small organic molecule
Emp. Form.:
C32H41FN2O5
Mol. Mass.:
552.6767
SMILES:
C[C@H]1CCCN1C(=O)N1Cc2c(C1)c(C)c(-c1cc(F)c3OCCCc3c1C)c([C@H](OC(C)(C)C)C(O)=O)c2C
: