Target
Replicase polyprotein 1a
Ligand
BDBM420286
Substrate
Meas. Tech.
Measurement of SARS-CoV 3CLpro activity using FRET
IC50
46000±n/a nM
Citation
 Liu, YCHuang, VChao, TCHsiao, CDLin, AChang, MFChow, LP Screening of drugs by FRET analysis identifies inhibitors of SARS-CoV 3CL protease. Biochem Biophys Res Commun 333:194-9 (2005)  
Target
Name:
Replicase polyprotein 1a
Synonyms:
3C-like proteinase 3CLp Growth factor-like peptide Non-structural protein 1 Non-structural protein 11 Non-structural protein 3 Non-structural protein 6 Non-structural protein 8 ORF1a polyprotein PL2-PRO Papain-like proteinase Replicase polyprotein 1a SARS coronavirus 3C-like proteinase nsp1 nsp11 nsp3 nsp5 nsp7 nsp9 pp1a
Type:
Enzyme
Mol. Mass.:
486353.36
Organism:
Human SARS coronavirus (SARS-CoV)
Description:
P0C6U8
Residue:
4382
  
Inhibitor
Name:
BDBM420286
Synonyms:
HL-5
Type:
Small organic molecule
Emp. Form.:
C12H6Cl2N2O6S
Mol. Mass.:
377.157
SMILES:
Oc1c(Sc2cc(Cl)cc(c2O)[N+]([O-])=O)cc(Cl)cc1[N+]([O-])=O
: