Target
Replicase polyprotein 1ab
Ligand
BDBM420977
Substrate
Meas. Tech.
IC50 Determination
IC50
2800±200 nM
Citation
 St. John, SEMesecar, AD Broad-spectrum non-covalent coronavirus protease inhibitors US Patent  US9975885 Publication Date 5/22/2018 
Target
Name:
Replicase polyprotein 1ab
Synonyms:
ORF1ab polyprotein pp1ab | rep
Type:
Protein
Mol. Mass.:
797943.10
Organism:
HCoV-OC43
Description:
P0C6X6
Residue:
7095
  
Inhibitor
Name:
BDBM420977
Synonyms:
US9975885, Compound 32
Type:
Small organic molecule
Emp. Form.:
C27H26N6O3S
Mol. Mass.:
514.599
SMILES:
O=C(Cn1nnc2ccccc12)N(C(C(=O)NC1CC1)c1ccsc1)c1ccc(NC(=O)C2CC2)cc1
: