Target
Replicase polyprotein 1ab
Ligand
BDBM420978
Substrate
Meas. Tech.
IC50 Determination
IC50
4200±600 nM
Citation
 St. John, SEMesecar, AD Broad-spectrum non-covalent coronavirus protease inhibitors US Patent  US9975885 Publication Date 5/22/2018 
Target
Name:
Replicase polyprotein 1ab
Synonyms:
3C-like proteinase 3C-like proteinase (SARS-CoV 3Cpro) 3CLp GFL Guanine-N7 methyltransferase Helicase Leader protein Non-structural protein 10 Non-structural protein 3 Non-structural protein 6 Non-structural protein 8 ORF1ab polyprotein PL2-PRO Pol R1AB_SARS RdRp SARS coronavirus main proteinase nsp1 nsp12 nsp14 nsp16 nsp3 nsp5 nsp7 nsp9 pp1ab | rep
Type:
Protein
Mol. Mass.:
790250.81
Organism:
Human SARS coronavirus (SARS-CoV) (Severe acute respiratory syndrome coronavirus)
Description:
P0C6X7
Residue:
7073
  
Inhibitor
Name:
BDBM420978
Synonyms:
US9975885, Compound 33
Type:
Small organic molecule
Emp. Form.:
C29H30N6O3S
Mol. Mass.:
542.652
SMILES:
O=C(Cn1nnc2ccccc12)N(C(C(=O)NC1CCCC1)c1ccsc1)c1ccc(NC(=O)C2CC2)cc1
: