Target
Replicase polyprotein 1ab
Ligand
BDBM420981
Substrate
Meas. Tech.
IC50 Determination
IC50
4500±300 nM
Citation
 St. John, SEMesecar, AD Broad-spectrum non-covalent coronavirus protease inhibitors US Patent  US9975885 Publication Date 5/22/2018 
Target
Name:
Replicase polyprotein 1ab
Synonyms:
ORF1ab polyprotein pp1ab | rep
Type:
Protein
Mol. Mass.:
797943.10
Organism:
HCoV-OC43
Description:
P0C6X6
Residue:
7095
  
Inhibitor
Name:
BDBM420981
Synonyms:
US9975885, Compound 64
Type:
Small organic molecule
Emp. Form.:
C30H32N6O5S
Mol. Mass.:
588.677
SMILES:
CC(C)(C)OC(=O)CNC(=O)C(N(C(=O)Cn1nnc2ccccc12)c1ccc(NC(=O)C2CC2)cc1)c1ccsc1
: