Target
Replicase polyprotein 1ab
Ligand
BDBM420987
Substrate
Meas. Tech.
IC50 Determination
IC50
18200±2200 nM
Citation
 St. John, SEMesecar, AD Broad-spectrum non-covalent coronavirus protease inhibitors US Patent  US9975885 Publication Date 5/22/2018 
Target
Name:
Replicase polyprotein 1ab
Synonyms:
ORF1ab polyprotein pp1ab | rep
Type:
Protein
Mol. Mass.:
769767.17
Organism:
BtCoV
Description:
P0C6W5
Residue:
6930
  
Inhibitor
Name:
BDBM420987
Synonyms:
US9975885, Compound 40
Type:
Small organic molecule
Emp. Form.:
C25H29N5O2
Mol. Mass.:
431.5301
SMILES:
CC(C)(C)NC(=O)C(N(C(=O)c1c[nH]cn1)c1ccc(cc1)C1CCC1)c1cccnc1
: