Target
ADP-ribosylhydrolase ARH3
Ligand
BDBM421529
Substrate
Meas. Tech.
ARH3 Assay
IC50
>150000±n/a nM
Citation
 McGonagle, AEJordan, AMWaszkowycz, BHutton, CPWaddell, IDHitchin, JRSmith, KMHamilton, NM PARG inhibitory compounds US Patent  US10508086 Publication Date 12/17/2019 
Target
Name:
ADP-ribosylhydrolase ARH3
Synonyms:
ADP-ribose glycohydrolase ARH3 ADPRHL2 ADPRS_HUMAN O-acetyl-ADP-ribose deacetylase ARH3 [Protein ADP-ribosylarginine] hydrolase-like protein 2 | [Protein ADP-ribosylserine] hydrolase
Type:
Enzyme Catalytic Domain
Mol. Mass.:
38934.22
Organism:
Homo sapiens (Human)
Description:
Q9NX46
Residue:
363
  
Inhibitor
Name:
BDBM421529
Synonyms:
US10508086, Example 119 | US10995073, Example 119
Type:
Small organic molecule
Emp. Form.:
C14H15N5O2S2
Mol. Mass.:
349.431
SMILES:
Cc1nnc(s1)-n1cnc2ccc(cc12)S(=O)(=O)NC1(C)CC1
: