Target
Activin receptor type-1B
Ligand
BDBM280345
Substrate
Meas. Tech.
In Vitro Kinase Assay
IC50
30.4±n/a nM
Citation
 Rai, RChakravarty, SPujala, BShinde, BUNayak, AKChaklan, NAgarwal, AKRamachandran, SAPham, SM Compounds and methods of use US Patent  US10501436 Publication Date 12/10/2019 
Target
Name:
Activin receptor type-1B
Synonyms:
ACV1B_HUMAN ACVRLK4 Activin receptor type-1B/Activin receptor-like kinase 4 (ALK-4)
Type:
PROTEIN
Mol. Mass.:
56810.99
Organism:
Homo sapiens (Human)
Description:
ChEMBL_587064
Residue:
505
  
Inhibitor
Name:
BDBM280345
Synonyms:
(S)-4-(2-(5-chloro-2-fluorophenyl)-5-isopropylpyridin-4-ylamino)-N-(2-hydroxypropyl)pyrimidine-5-carboxamide US10501436, Compound 12a US11702401, Compound 12a
Type:
Small organic molecule
Emp. Form.:
C22H23ClFN5O2
Mol. Mass.:
443.902
SMILES:
C[C@H](O)CNC(=O)c1cncnc1Nc1cc(ncc1C(C)C)-c1cc(Cl)ccc1F
: