Target
Activin receptor type-1B
Ligand
BDBM280369
Substrate
Meas. Tech.
In Vitro Kinase Assay
IC50
3.70±n/a nM
Citation
 Rai, RChakravarty, SPujala, BShinde, BUNayak, AKChaklan, NAgarwal, AKRamachandran, SAPham, SM Compounds and methods of use US Patent  US10501436 Publication Date 12/10/2019 
Target
Name:
Activin receptor type-1B
Synonyms:
ACV1B_HUMAN ACVRLK4 Activin receptor type-1B/Activin receptor-like kinase 4 (ALK-4)
Type:
PROTEIN
Mol. Mass.:
56810.99
Organism:
Homo sapiens (Human)
Description:
ChEMBL_587064
Residue:
505
  
Inhibitor
Name:
BDBM280369
Synonyms:
2-(5-chloro-2-fluorophenyl)-5-(propan-2-yl)-N-{7H-pyrrolo[2,3-d]pyrimidin-4-yl}pyridin-4-amine US10501436, Compound 35 US11702401, Compound 35
Type:
Small organic molecule
Emp. Form.:
C20H17ClFN5
Mol. Mass.:
381.834
SMILES:
CC(C)c1cnc(cc1Nc1ncnc2[nH]ccc12)-c1cc(Cl)ccc1F
: