Target
Dual specificity calcium/calmodulin-dependent 3',5'-cyclic nucleotide phosphodiesterase 1A
Ligand
BDBM279103
Substrate
Meas. Tech.
PDE1 Inhibition Assay
IC50
0.960±n/a nM
Citation
 Kehler, JJuhl, KMarigo, MVital, PJJessing, MLanggård, MRasmussen, LKClementson, CM 1 H-pyrazolo[4,3-B]pyridines as PDE1 inhibitors US Patent  US10512632 Publication Date 12/24/2019 
Target
Name:
Dual specificity calcium/calmodulin-dependent 3',5'-cyclic nucleotide phosphodiesterase 1A
Synonyms:
61 kDa Cam-PDE Cam-PDE 1A PDE1A_HUMAN | hCam-1
Type:
Protein
Mol. Mass.:
61245.69
Organism:
Homo sapiens (Human)
Description:
P54750
Residue:
535
  
Inhibitor
Name:
BDBM279103
Synonyms:
3-methyl-1-[1-methylpropyl]-N-[(1-methyl-1,2,4-triazol-3-yl)methyl]-5-(2-propoxy-3-pyridyl)pyrazolo[4,3-b]pyridin-7-amine,enantiomer 2 US10512632, Example 134 US10806718, Example 134 US11634416, Example 134
Type:
Small organic molecule
Emp. Form.:
C23H30N8O
Mol. Mass.:
434.5373
SMILES:
CCCOc1ncccc1-c1cc(NCc2ncn(C)n2)c2n(nc(C)c2n1)C(C)CC
: