Target
2-amino-3-carboxymuconate-6-semialdehyde decarboxylase
Ligand
BDBM261604
Substrate
Meas. Tech.
spectrophotometrical in vitro assay
IC50
760±n/a nM
Citation
 Pellicciari, RAuwerx, JRaffaelli, N Inhibitors of alpha-amino-beta-carboxymuconic acid semialdehyde decarboxylase US Patent  US10513499 Publication Date 12/24/2019 
Target
Name:
2-amino-3-carboxymuconate-6-semialdehyde decarboxylase
Synonyms:
ACMSD Picolinate carboxylase
Type:
Enzyme Catalytic Domain
Mol. Mass.:
38037.38
Organism:
Homo sapiens (Human)
Description:
Q8TDX5
Residue:
336
  
Inhibitor
Name:
BDBM261604
Synonyms:
US10513499, Compound 15 US9708272, 15
Type:
Small organic molecule
Emp. Form.:
C16H12N2O3S2
Mol. Mass.:
344.408
SMILES:
OC(=O)c1cccc(CSc2nc(cc(=O)[nH]2)-c2cccs2)c1
: