Target
2-amino-3-carboxymuconate-6-semialdehyde decarboxylase
Ligand
BDBM261606
Substrate
Meas. Tech.
spectrophotometrical in vitro assay
IC50
5.00±n/a nM
Citation
 Pellicciari, RAuwerx, JRaffaelli, N Inhibitors of alpha-amino-beta-carboxymuconic acid semialdehyde decarboxylase US Patent  US10513499 Publication Date 12/24/2019 
Target
Name:
2-amino-3-carboxymuconate-6-semialdehyde decarboxylase
Synonyms:
ACMSD Picolinate carboxylase
Type:
Enzyme Catalytic Domain
Mol. Mass.:
38037.38
Organism:
Homo sapiens (Human)
Description:
Q8TDX5
Residue:
336
  
Inhibitor
Name:
BDBM261606
Synonyms:
US10513499, Compound 17 US9708272, 17
Type:
Small organic molecule
Emp. Form.:
C17H11N7OS2
Mol. Mass.:
393.446
SMILES:
O=c1[nH]c(SCc2cccc(c2)-c2nn[nH]n2)nc(-c2cccs2)c1C#N
: