Target
Replicase polyprotein 1ab
Ligand
BDBM420296
Substrate
Meas. Tech.
No assay is provided
EC50
420±n/a nM
Citation
 Pillaiyar, TWendt, LLManickam, MEaswaran, M The recent outbreaks of human coronaviruses: A medicinal chemistry perspective. Med Res Rev 0:0 (2020)  
Target
Name:
Replicase polyprotein 1ab
Synonyms:
ORF1ab polyprotein pp1ab | rep
Type:
Protein
Mol. Mass.:
794070.71
Organism:
2019-nCoV
Description:
P0DTD1
Residue:
7096
  
Inhibitor
Name:
BDBM420296
Synonyms:
Advanced SARS-CoV-2 Inhibitor 11a acs.jmedchem.1c00409_ST.40 peptidomimetic aldehydes 11a | peptidomimetic coronavirus 3CLpro inhibitors 11a
Type:
Small organic molecule
Emp. Form.:
C25H32N4O4
Mol. Mass.:
452.546
SMILES:
O=C[C@H](C[C@@H]1CCNC1=O)NC(=O)[C@H](CC1CCCCC1)NC(=O)c1cc2ccccc2[nH]1
: