Target
Replicase polyprotein 1ab
Ligand
BDBM11292
Substrate
Meas. Tech.
No assay is provided
IC50
300±n/a nM
Citation
 Pillaiyar, TWendt, LLManickam, MEaswaran, M The recent outbreaks of human coronaviruses: A medicinal chemistry perspective. Med Res Rev 0:0 (2020)  
Target
Name:
Replicase polyprotein 1ab
Synonyms:
3C-like proteinase 3C-like proteinase (SARS-CoV 3Cpro) 3CLp GFL Guanine-N7 methyltransferase Helicase Leader protein Non-structural protein 10 Non-structural protein 3 Non-structural protein 6 Non-structural protein 8 ORF1ab polyprotein PL2-PRO Pol R1AB_SARS RdRp SARS coronavirus main proteinase nsp1 nsp12 nsp14 nsp16 nsp3 nsp5 nsp7 nsp9 pp1ab | rep
Type:
Protein
Mol. Mass.:
790250.81
Organism:
Human SARS coronavirus (SARS-CoV) (Severe acute respiratory syndrome coronavirus)
Description:
P0C6X7
Residue:
7073
  
Inhibitor
Name:
BDBM11292
Synonyms:
1,5-dichloro-2-{[2,6-dinitro-4-(trifluoromethyl)benzene]sulfonyl}-4-methylbenzene acs.jmedchem.1c00409_ST.137 med.21724, Compound 147
Type:
Small organic molecule
Emp. Form.:
C14H7Cl2F3N2O6S
Mol. Mass.:
459.181
SMILES:
Cc1cc(c(Cl)cc1Cl)S(=O)(=O)c1c(cc(cc1[N+]([O-])=O)C(F)(F)F)[N+]([O-])=O
: