Target
Replicase polyprotein 1a
Ligand
BDBM50007790
Substrate
Meas. Tech.
No assay is provided
IC50
490±n/a nM
Citation
 Pillaiyar, TWendt, LLManickam, MEaswaran, M The recent outbreaks of human coronaviruses: A medicinal chemistry perspective. Med Res Rev 0:0 (2020)  
Target
Name:
Replicase polyprotein 1a
Synonyms:
3C-like proteinase 3CLp Growth factor-like peptide Non-structural protein 1 Non-structural protein 11 Non-structural protein 3 Non-structural protein 6 Non-structural protein 8 ORF1a polyprotein PL2-PRO Papain-like proteinase Replicase polyprotein 1a SARS coronavirus 3C-like proteinase nsp1 nsp11 nsp3 nsp5 nsp7 nsp9 pp1a
Type:
Enzyme
Mol. Mass.:
486353.36
Organism:
Human SARS coronavirus (SARS-CoV)
Description:
P0C6U8
Residue:
4382
  
Inhibitor
Name:
BDBM50007790
Synonyms:
CHEMBL3233814 | med.21724, Compound 169
Type:
Small organic molecule
Emp. Form.:
C25H27FN2O
Mol. Mass.:
390.4931
SMILES:
C[C@@H](N1CCC(CC1)C(=O)NCc1ccc(F)cc1)c1cccc2ccccc12
: