Target
Replicase polyprotein 1ab
Ligand
BDBM430624
Substrate
Meas. Tech.
SARS-CoV-2 in Calu-3
IC50
80±0.0 nM
Citation
 Sheahan, TPSims, ACZhou, SGraham, RLPruijssers, AJAgostini, MLLeist, SRSchäfer, ADinnon, KHStevens, LJChappell, JDLu, XHughes, TMGeorge, ASHill, CSMontgomery, SABrown, AJBluemling, GRNatchus, MGSaindane, MKolykhalov, AAPainter, GHarcourt, JTamin, AThornburg, NJSwanstrom, RDenison, MRBaric, RS An orally bioavailable broad-spectrum antiviral inhibits SARS-CoV-2 in human airway epithelial cell cultures and multiple coronaviruses in mice. Sci Transl Med 12:1-15 (2020)  
Target
Name:
Replicase polyprotein 1ab
Synonyms:
ORF1ab polyprotein pp1ab | rep
Type:
Protein
Mol. Mass.:
794070.71
Organism:
2019-nCoV
Description:
P0DTD1
Residue:
7096
  
Inhibitor
Name:
BDBM430624
Synonyms:
Beta-D-N4-hydroxycytidine N(4)-Hydroxycytidine NHC | Uridine, 4-oxime
Type:
Small organic molecule
Emp. Form.:
C9H13N3O6
Mol. Mass.:
259.216
SMILES:
OC[C@H]1O[C@H]([C@H](O)[C@@H]1O)n1ccc(NO)nc1=O
: