Target
Replicase polyprotein 1ab
Ligand
BDBM430657
Substrate
Meas. Tech.
DRC analysis by immunofluorescence
IC50
4510±n/a nM
Citation
 Jeon, SKo, MLee, JChoi, IByun, SYPark, SShum, DKim, S Identification of Antiviral Drug Candidates against SARS-CoV-2 from FDA-Approved Drugs. Antimicrob Agents Chemother 64:0 (2020)  
Target
Name:
Replicase polyprotein 1ab
Synonyms:
ORF1ab polyprotein pp1ab | rep
Type:
Protein
Mol. Mass.:
794070.71
Organism:
2019-nCoV
Description:
P0DTD1
Residue:
7096
  
Inhibitor
Name:
BDBM430657
Synonyms:
Isopomiferin
Type:
Small Organic Molecule
Emp. Form.:
C25H24O6
Mol. Mass.:
420.4545
SMILES:
CC1(C)CCc2c3OC(C)(C)C=Cc3c3occ(-c4ccc(O)c(O)c4)c(=O)c3c2O1
: