Target
Replicase polyprotein 1ab
Ligand
BDBM50442397
Substrate
Meas. Tech.
DRC analysis by immunofluorescence
IC50
3870±n/a nM
Citation
 Jeon, SKo, MLee, JChoi, IByun, SYPark, SShum, DKim, S Identification of Antiviral Drug Candidates against SARS-CoV-2 from FDA-Approved Drugs. Antimicrob Agents Chemother 64:0 (2020)  
Target
Name:
Replicase polyprotein 1ab
Synonyms:
ORF1ab polyprotein pp1ab | rep
Type:
Protein
Mol. Mass.:
794070.71
Organism:
2019-nCoV
Description:
P0DTD1
Residue:
7096
  
Inhibitor
Name:
BDBM50442397
Synonyms:
OSAJIN
Type:
Small organic molecule
Emp. Form.:
C25H24O5
Mol. Mass.:
404.4551
SMILES:
[#6]\[#6](-[#6])=[#6]\[#6]-c1c(-[#8])c2c(occ(-c3ccc(-[#8])cc3)c2=O)c2-[#6]=[#6]C([#6])([#6])[#8]-c12
: