Target
Replicase polyprotein 1ab
Ligand
BDBM50110183
Substrate
Meas. Tech.
DRC analysis by immunofluorescence
IC50
6620±n/a nM
Citation
 Jeon, SKo, MLee, JChoi, IByun, SYPark, SShum, DKim, S Identification of Antiviral Drug Candidates against SARS-CoV-2 from FDA-Approved Drugs. Antimicrob Agents Chemother 64:0 (2020)  
Target
Name:
Replicase polyprotein 1ab
Synonyms:
ORF1ab polyprotein pp1ab | rep
Type:
Protein
Mol. Mass.:
794070.71
Organism:
2019-nCoV
Description:
P0DTD1
Residue:
7096
  
Inhibitor
Name:
BDBM50110183
Synonyms:
Abemaciclib US10626107, Example LY2835219 US10696678, Example LY2835219 US11053238, LY2835219 US11351170, Example Abemaciclib
Type:
Small organic molecule
Emp. Form.:
C27H32F2N8
Mol. Mass.:
506.5934
SMILES:
CCN1CCN(Cc2ccc(Nc3ncc(F)c(n3)-c3cc(F)c4nc(C)n(C(C)C)c4c3)nc2)CC1
: