Target
Replicase polyprotein 1ab
Ligand
BDBM430671
Substrate
Meas. Tech.
DRC analysis by immunofluorescence
IC50
6600±n/a nM
Citation
 Jeon, SKo, MLee, JChoi, IByun, SYPark, SShum, DKim, S Identification of Antiviral Drug Candidates against SARS-CoV-2 from FDA-Approved Drugs. Antimicrob Agents Chemother 64:0 (2020)  
Target
Name:
Replicase polyprotein 1ab
Synonyms:
ORF1ab polyprotein pp1ab | rep
Type:
Protein
Mol. Mass.:
794070.71
Organism:
2019-nCoV
Description:
P0DTD1
Residue:
7096
  
Inhibitor
Name:
BDBM430671
Synonyms:
Droloxifene
Type:
Small Organic Molecule
Emp. Form.:
C26H29NO2
Mol. Mass.:
387.514
SMILES:
CC\C(=C(\c1ccc(OCCN(C)C)cc1)c1cccc(O)c1)c1ccccc1
: