Target
Replicase polyprotein 1ab
Ligand
BDBM50180655
Substrate
Meas. Tech.
DRC analysis by immunofluorescence
IC50
15270±n/a nM
Citation
 Jeon, SKo, MLee, JChoi, IByun, SYPark, SShum, DKim, S Identification of Antiviral Drug Candidates against SARS-CoV-2 from FDA-Approved Drugs. Antimicrob Agents Chemother 64:0 (2020)  
Target
Name:
Replicase polyprotein 1ab
Synonyms:
ORF1ab polyprotein pp1ab | rep
Type:
Protein
Mol. Mass.:
794070.71
Organism:
2019-nCoV
Description:
P0DTD1
Residue:
7096
  
Inhibitor
Name:
BDBM50180655
Synonyms:
A-157378-0 ABT-378 Kaletra med.21724, Compound 185
Type:
Small organic molecule
Emp. Form.:
C37H48N4O5
Mol. Mass.:
628.8008
SMILES:
CC(C)[C@H](N1CCCNC1=O)C(=O)N[C@H](C[C@H](O)[C@H](Cc1ccccc1)NC(=O)COc1c(C)cccc1C)Cc1ccccc1
: