Target
Histone-lysine N-methyltransferase EZH2
Ligand
BDBM50246953
Substrate
Meas. Tech.
Biological Assay
IC50
2.00±n/a nM
Citation
 Collins, MRKania, RSKumpf, RAKung, PRichter, DTSutton, SCWythes, MJ Substituted dihydroisoquinolinone compounds US Patent  US10570121 Publication Date 2/25/2020 
Target
Name:
Histone-lysine N-methyltransferase EZH2
Synonyms:
ENX-1 EZH2_HUMAN Histone-lysine N-methyltransferase EZH2 Lysine N-methyltransferase 6
Type:
Protein
Mol. Mass.:
85367.84
Organism:
Homo sapiens (Human)
Description:
Q15910
Residue:
746
  
Inhibitor
Name:
BDBM50246953
Synonyms:
CHEMBL4090352 | US10570121, Example 3
Type:
Small organic molecule
Emp. Form.:
C23H26Cl2N2O4
Mol. Mass.:
465.37
SMILES:
Cc1cc(C)c(CN2CCc3c(Cl)cc(C(CO)C4CCOC4)c(Cl)c3C2=O)c(=O)[nH]1
: