Target
Tyrosyl-DNA phosphodiesterase 2
Ligand
BDBM437709
Substrate
Meas. Tech.
Biochemical Potency
IC50
3.85±0.37 nM
Citation
 Wang, ZKankanala, JPommier, Y Compounds for cancer chemotherapeutic sensitization US Patent  US10617706 Publication Date 4/14/2020 
Target
Name:
Tyrosyl-DNA phosphodiesterase 2
Synonyms:
EAP2 ETS1-associated protein 2 TDP2 TTRAP Tyr-DNA phosphodiesterase 2 Tyrosyl-DNA phosphodiesterase 2 (hTDP2) VPg unlinkase | hTDP2
Type:
Enzyme Catalytic Domain
Mol. Mass.:
40916.54
Organism:
Homo sapiens (Human)
Description:
gi_23510348
Residue:
362
  
Inhibitor
Name:
BDBM437709
Synonyms:
US10617706, Example 143
Type:
Small organic molecule
Emp. Form.:
C24H16BClN4O4
Mol. Mass.:
470.672
SMILES:
OB(O)c1cccc(c1)N1C2NC(=O)N(C(=O)C2=Cc2ccc(cc12)C#N)c1ccc(Cl)cc1
: