Target
ALK tyrosine kinase receptor
Ligand
BDBM374728
Substrate
Meas. Tech.
Kinase Binding Assays
Kd
14.0±n/a nM
Citation
 Cui, JJLi, YRogers, EWZhai, D Diaryl macrocycles as modulators of protein kinases US Patent  US10618912 Publication Date 4/14/2020 
Target
Name:
ALK tyrosine kinase receptor
Synonyms:
ALK ALK_HUMAN CD_antigen: CD246
Type:
Protein
Mol. Mass.:
176453.10
Organism:
Homo sapiens (Human)
Description:
Q9UM73
Residue:
1620
  
Inhibitor
Name:
BDBM374728
Synonyms:
11-fluoro-13-(hydroxymethyl)-6,7,13,14- tetrahydro-1,15-ethenopyrazolo[4,3- f][1,4,8,10]benzoxatriazacyclotridecin-4(5H)- one US10618912, Example 98
Type:
Small organic molecule
Emp. Form.:
C17H16FN5O3
Mol. Mass.:
357.339
SMILES:
OCC1Nc2ccn3ncc(C(=O)NCCOc4ccc(F)cc14)c3n2
: