Target
cGMP-dependent 3',5'-cyclic phosphodiesterase
Ligand
BDBM442766
Substrate
Meas. Tech.
Inhibitory Activity Assay (Lab B)
Ki
16.0±n/a nM
Citation
 Morriello, GJChang, LForster, ABerger, RNanda, KKShipe, WD Substituted pyrazolo/imidazolo bicyclic compounds as PDE2 inhibitors US Patent  US10647727 Publication Date 5/12/2020 
Target
Name:
cGMP-dependent 3',5'-cyclic phosphodiesterase
Synonyms:
CGS-PDE Homo sapiens phosphodiesterase 2A (PDE2A) PDE2A cGSPDE
Type:
Enzyme Catalytic Domain
Mol. Mass.:
105691.58
Organism:
Homo sapiens (Human)
Description:
O00408
Residue:
941
  
Inhibitor
Name:
BDBM442766
Synonyms:
1,6-Dimethyl-N- (1-{4- [(trifluoromethyl)- sulfanyl]phenyl}- cyclopropyl)-1H- pyrazolo[3,4-d]- pyrimidin-4-amine | US10647727, Example 23
Type:
Small organic molecule
Emp. Form.:
C17H16F3N5S
Mol. Mass.:
379.403
SMILES:
Cc1nc(NC2(CC2)c2ccc(SC(F)(F)F)cc2)c2cnn(C)c2n1
: