Target
cGMP-dependent 3',5'-cyclic phosphodiesterase
Ligand
BDBM442773
Substrate
Meas. Tech.
Inhibitory Activity Assay (Lab B)
Ki
32.0±n/a nM
Citation
 Morriello, GJChang, LForster, ABerger, RNanda, KKShipe, WD Substituted pyrazolo/imidazolo bicyclic compounds as PDE2 inhibitors US Patent  US10647727 Publication Date 5/12/2020 
Target
Name:
cGMP-dependent 3',5'-cyclic phosphodiesterase
Synonyms:
CGS-PDE Homo sapiens phosphodiesterase 2A (PDE2A) PDE2A cGSPDE
Type:
Enzyme Catalytic Domain
Mol. Mass.:
105691.58
Organism:
Homo sapiens (Human)
Description:
O00408
Residue:
941
  
Inhibitor
Name:
BDBM442773
Synonyms:
1,6-Dimethyl-4-({1-[4-(trifluoromethyl)phenyl]cyclopropyl}oxy)-1H-pyrazolo[3,4-d]pyrimidine | US10647727, Example 30
Type:
Small organic molecule
Emp. Form.:
C17H15F3N4O
Mol. Mass.:
348.3224
SMILES:
Cc1nc(OC2(CC2)c2ccc(cc2)C(F)(F)F)c2cnn(C)c2n1
: