Target
cGMP-dependent 3',5'-cyclic phosphodiesterase
Ligand
BDBM442784
Substrate
Meas. Tech.
Inhibitory Activity Assay (Lab B)
Ki
337±n/a nM
Citation
 Morriello, GJChang, LForster, ABerger, RNanda, KKShipe, WD Substituted pyrazolo/imidazolo bicyclic compounds as PDE2 inhibitors US Patent  US10647727 Publication Date 5/12/2020 
Target
Name:
cGMP-dependent 3',5'-cyclic phosphodiesterase
Synonyms:
CGS-PDE Homo sapiens phosphodiesterase 2A (PDE2A) PDE2A cGSPDE
Type:
Enzyme Catalytic Domain
Mol. Mass.:
105691.58
Organism:
Homo sapiens (Human)
Description:
O00408
Residue:
941
  
Inhibitor
Name:
BDBM442784
Synonyms:
N7-{1-[3-Fluoro-4-(trifluoromethyl)phenyl]cyclopropyl}-5-methylpyrazolo[1,5-a]pyrimidine-3,7-diamine | US10647727, Example 41
Type:
Small organic molecule
Emp. Form.:
C17H15F4N5
Mol. Mass.:
365.3281
SMILES:
Cc1cc(NC2(CC2)c2ccc(c(F)c2)C(F)(F)F)n2ncc(N)c2n1
: