Target
cGMP-dependent 3',5'-cyclic phosphodiesterase
Ligand
BDBM442789
Substrate
Meas. Tech.
Inhibitory Activity Assay (Lab B)
Ki
2640±n/a nM
Citation
 Morriello, GJChang, LForster, ABerger, RNanda, KKShipe, WD Substituted pyrazolo/imidazolo bicyclic compounds as PDE2 inhibitors US Patent  US10647727 Publication Date 5/12/2020 
Target
Name:
cGMP-dependent 3',5'-cyclic phosphodiesterase
Synonyms:
CGS-PDE Homo sapiens phosphodiesterase 2A (PDE2A) PDE2A cGSPDE
Type:
Enzyme Catalytic Domain
Mol. Mass.:
105691.58
Organism:
Homo sapiens (Human)
Description:
O00408
Residue:
941
  
Inhibitor
Name:
BDBM442789
Synonyms:
US10647727, Example 46 | [7-({1-[3-Fluoro-4-(trifluoromethyl)phenyl]cyclopropyl}amino)-5-methylpyrazolo[1,5-a]pyrimidin-3-yl]methanol
Type:
Small organic molecule
Emp. Form.:
C20H22F4N4O
Mol. Mass.:
410.4085
SMILES:
Cc1cc(N[C@@H](c2ccc(c(F)c2)C(F)(F)F)C(C)(C)C)n2ncc(CO)c2n1
: