Target
Replicase polyprotein 1ab
Ligand
BDBM420296
Substrate
Meas. Tech.
fluorescent peptide assay
Ki
30±2.90 nM
IC50
31±3.00 nM
Citation
 Yang, KSMa, XRMa, YAlugubelli, YRScott, DAVatansever, ECDrelich, AKSankaran, BGeng, ZZBlankenship, LRWard, HESheng, YJHsu, JCKratch, KCZhao, BHayatshahi, HSLiu, JLi, PFierke, CATseng, CKXu, SLiu, WR A Quick Route to Multiple Highly Potent SARS-CoV-2 Main Protease Inhibitors ChemMedChem 0:0 (2020)  
Target
Name:
Replicase polyprotein 1ab
Synonyms:
ORF1ab polyprotein pp1ab | rep
Type:
Protein
Mol. Mass.:
794070.71
Organism:
2019-nCoV
Description:
P0DTD1
Residue:
7096
  
Inhibitor
Name:
BDBM420296
Synonyms:
Advanced SARS-CoV-2 Inhibitor 11a acs.jmedchem.1c00409_ST.40 peptidomimetic aldehydes 11a | peptidomimetic coronavirus 3CLpro inhibitors 11a
Type:
Small organic molecule
Emp. Form.:
C25H32N4O4
Mol. Mass.:
452.546
SMILES:
O=C[C@H](C[C@@H]1CCNC1=O)NC(=O)[C@H](CC1CCCCC1)NC(=O)c1cc2ccccc2[nH]1
: