Target
Replicase polyprotein 1ab
Ligand
BDBM50084655
Substrate
Meas. Tech.
Antiviral activity assays
EC50
<1560±0.0 nM
Citation
 Günther, SReinke, PYFernández-García, YLieske, JLane, TJGinn, HMKoua, FHEhrt, CEwert, WOberthuer, DYefanov, OMeier, SLorenzen, KKrichel, BKopicki, JGelisio, LBrehm, WDunkel, ISeychell, BGieseler, HNorton-Baker, BEscudero-Pérez, BDomaracky, MSaouane, STolstikova, AWhite, TAHänle, AGroessler, MFleckenstein, HTrost, FGalchenkova, MGevorkov, YLi, CAwel, SPeck, ABarthelmess, MSchlünzen, FXavier, PLWerner, NAndaleeb, HUllah, NFalke, SSrinivasan, VFranca, BASchwinzer, MBrognaro, HRogers, CMelo, DZaitsev-Doyle, JJKnoska, JPeña Murillo, GEMashhour, ARGuicking, FHennicke, VFischer, PHakanpää, JMeyer, JGribbon, PEllinger, BKuzikov, MWolf, MBeccari, ARBourenkov, GStetten, DPompidor, GBento, IPanneerselvam, SKarpics, ISchneider, TRGarcia Alai, MMNiebling, SGünther, CSchmidt, CSchubert, RHan, HBoger, JMonteiro, DCZhang, LSun, XPletzer-Zelgert, JWollenhaupt, JFeiler, CGWeiss, MSSchulz, EMehrabi, PKarničar, KUsenik, ALoboda, JTidow, HChari, AHilgenfeld, RUetrecht, CCox, RZaliani, ABeck, TRarey, MGünther, STurk, DHinrichs, WChapman, HNPearson, ARBetzel, CMeents, A Inhibition of SARS-CoV-2 main protease by allosteric drug-binding bioRxiv 2020:0 (2020)    Article 
Target
Name:
Replicase polyprotein 1ab
Synonyms:
ORF1ab polyprotein pp1ab | rep
Type:
Protein
Mol. Mass.:
794070.71
Organism:
2019-nCoV
Description:
P0DTD1
Residue:
7096
  
Inhibitor
Name:
BDBM50084655
Synonyms:
CHEMBL92708 Z-Leu-Nle-CHO [1-((S)-(S)-1-Formyl-pentylcarbamoyl)-3-methyl-butyl]-carbamic acid benzyl ester [1-(1-Formyl-pentylcarbamoyl)-3-methyl-butyl]-carbamic acid benzyl ester(calpeptin) | benzyl (S)-4-methyl-1-oxo-1-((S)-1-oxohexan-2-ylamino)pentan-2-ylcarbamate
Type:
Small organic molecule
Emp. Form.:
C20H30N2O4
Mol. Mass.:
362.4632
SMILES:
CCCC[C@H](NC(=O)[C@H](CC(C)C)NC(=O)OCc1ccccc1)C=O
: