Target
Replicase polyprotein 1ab
Ligand
BDBM7781
Substrate
Meas. Tech.
Hit profiling assay without DTT
IC50
140±n/a nM
Citation
 Kuzikov, MCostanzi, EReinshagen, JEsposito, FVangeel, LWolf, MEllinger, BClaussen, CGeisslinger, GCorona, AIaconis, DTalarico, CManelfi, CCannalire, RRossetti, GGossen, JAlbani, SMusiani, FHerzog, KYe, YGiabbai, BDemitri, NJochmans, DDe Jonghe, SRymenants, JSumma, VTramontano, EBeccari, ARLeyssen, PStorici, PNeyts, JGribbon, PZaliani, A Identification of inhibitors of SARS-CoV-2 3CL-Pro enzymatic activity using a small molecule in-vitro repurposing screen bioRxiv 2020:0 (2020)    Article 
Target
Name:
Replicase polyprotein 1ab
Synonyms:
ORF1ab polyprotein pp1ab | rep
Type:
Protein
Mol. Mass.:
794070.71
Organism:
2019-nCoV
Description:
P0DTD1
Residue:
7096
  
Inhibitor
Name:
BDBM7781
Synonyms:
4-Benzyl-2-methyl-1,2,4-thiadiazolidine-3,5-dione TDZD-8 US20230414581, Compound 1
Type:
Small organic molecule
Emp. Form.:
C10H10N2O2S
Mol. Mass.:
222.264
SMILES:
Cn1sc(=O)n(Cc2ccccc2)c1=O
: