Target
Replicase polyprotein 1ab
Ligand
BDBM12590
Substrate
Meas. Tech.
Hit profiling assay without DTT
IC50
830±n/a nM
Citation
 Kuzikov, MCostanzi, EReinshagen, JEsposito, FVangeel, LWolf, MEllinger, BClaussen, CGeisslinger, GCorona, AIaconis, DTalarico, CManelfi, CCannalire, RRossetti, GGossen, JAlbani, SMusiani, FHerzog, KYe, YGiabbai, BDemitri, NJochmans, DDe Jonghe, SRymenants, JSumma, VTramontano, EBeccari, ARLeyssen, PStorici, PNeyts, JGribbon, PZaliani, A Identification of inhibitors of SARS-CoV-2 3CL-Pro enzymatic activity using a small molecule in-vitro repurposing screen bioRxiv 2020:0 (2020)    Article 
Target
Name:
Replicase polyprotein 1ab
Synonyms:
ORF1ab polyprotein pp1ab | rep
Type:
Protein
Mol. Mass.:
794070.71
Organism:
2019-nCoV
Description:
P0DTD1
Residue:
7096
  
Inhibitor
Name:
BDBM12590
Synonyms:
(6-aminoacridin-3-yl)amine Proflavin SMR002533346 cid_7099
Type:
Small organic molecule
Emp. Form.:
C13H11N3
Mol. Mass.:
209.2465
SMILES:
Nc1ccc2cc3ccc(N)cc3nc2c1
: