Target
Replicase polyprotein 1ab
Ligand
BDBM64748
Substrate
Meas. Tech.
Hit profiling assay with DTT
IC50
1340±n/a nM
Citation
 Kuzikov, MCostanzi, EReinshagen, JEsposito, FVangeel, LWolf, MEllinger, BClaussen, CGeisslinger, GCorona, AIaconis, DTalarico, CManelfi, CCannalire, RRossetti, GGossen, JAlbani, SMusiani, FHerzog, KYe, YGiabbai, BDemitri, NJochmans, DDe Jonghe, SRymenants, JSumma, VTramontano, EBeccari, ARLeyssen, PStorici, PNeyts, JGribbon, PZaliani, A Identification of inhibitors of SARS-CoV-2 3CL-Pro enzymatic activity using a small molecule in-vitro repurposing screen bioRxiv 2020:0 (2020)    Article 
Target
Name:
Replicase polyprotein 1ab
Synonyms:
ORF1ab polyprotein pp1ab | rep
Type:
Protein
Mol. Mass.:
794070.71
Organism:
2019-nCoV
Description:
P0DTD1
Residue:
7096
  
Inhibitor
Name:
BDBM64748
Synonyms:
7-[(4-methyl-1-piperazinyl)-[4-(trifluoromethyl)phenyl]methyl]-8-quinolinol 7-[(4-methylpiperazino)-[4-(trifluoromethyl)phenyl]methyl]quinolin-8-ol ML311 SMR000594851 | cid_3878766
Type:
Small organic molecule
Emp. Form.:
C22H22F3N3O
Mol. Mass.:
401.4248
SMILES:
CN1CCN(CC1)C(c1ccc(cc1)C(F)(F)F)c1ccc2cccnc2c1O
: