Target
Replicase polyprotein 1ab
Ligand
BDBM448313
Substrate
Meas. Tech.
The enzymatic inhibition assay
IC50
94±1.20 nM
Citation
 Qiao, JLi, YSZeng, RLiu, FLLuo, RHHuang, CWang, YFZhang, JQuan, BShen, CMao, XLiu, XSun, WYang, WNi, XWang, KXu, LDuan, ZLZou, QCZhang, HLQu, WLong, YHLi, MHYang, RCLiu, XYou, JZhou, YYao, RLi, WPLiu, JMChen, PLiu, YLin, GFYang, XZou, JLi, LHu, YLu, GWLi, WMWei, YQZheng, YTLei, JYang, S SARS-CoV-2 Mpro inhibitors with antiviral activity in a transgenic mouse model Science 0:0 (2021)  
Target
Name:
Replicase polyprotein 1ab
Synonyms:
ORF1ab polyprotein pp1ab | rep
Type:
Protein
Mol. Mass.:
794070.71
Organism:
2019-nCoV
Description:
P0DTD1
Residue:
7096
  
Inhibitor
Name:
BDBM448313
Synonyms:
MI-27
Type:
Small organic molecule
Emp. Form.:
C25H31N3O7
Mol. Mass.:
485.5295
SMILES:
O=C[C@H](C[C@@H]1CCNC1=O)NC(=O)[C@H]1[C@@H]2CCC[C@H]2CN1C(=O)COc1ccc2OCCOc2c1
: